Target
5-hydroxytryptamine receptor 1A
Ligand
BDBM50289782
Substrate
Meas. Tech.
ChEMBL_201039 (CHEMBL803265)
Ki
7.8±n/a nM
Citation
 Reitz, ABMcDonnell, MEBaxter, EWCodd, EEWu, WN The synthesis and evaluation of the major metabolites of mazapertine Bioorg Med Chem Lett 7:1927-1930 (1997)    Article 
Target
Name:
5-hydroxytryptamine receptor 1A
Synonyms:
5-HT-1A 5-HT1A 5-hydroxytryptamine receptor 1A (5HT1A) 5ht1a Htr1a Serotonin 1a (5-HT1a) receptor/Adrenergic receptor alpha-1 | Serotonin receptor 1A
Type:
G Protein-Coupled Receptor (GPCR)
Mol. Mass.:
46445.29
Organism:
Rattus norvegicus (rat)
Description:
Binding assays were performed using rat hippocampal membranes.
Residue:
422
  
Inhibitor
Name:
BDBM50289782
Synonyms:
(4-Hydroxy-piperidin-1-yl)-{3-[4-(2-isopropoxy-phenyl)-piperazin-1-ylmethyl]-phenyl}-methanone | CHEMBL61096
Type:
Small organic molecule
Emp. Form.:
C26H35N3O3
Mol. Mass.:
437.5744
SMILES:
CC(C)Oc1ccccc1N1CCN(Cc2cccc(c2)C(=O)N2CCC(O)CC2)CC1
: