Target
Endothelin-1 receptor
Ligand
BDBM50289947
Substrate
Meas. Tech.
ChEBML_65481
IC50
680±n/a nM
Citation
 Raju, BWu, CCastillo, ROkun, IStavros, FChan, MF 2-Aryloxycarbonylthiophene-3-sulfonamides: Highly potent and etA selective endothelin receptor antagonists Bioorg Med Chem Lett 7:2093-2098 (1997)    Article 
Target
Name:
Endothelin-1 receptor
Synonyms:
EDNRA ET-A ETA-R Endothelin receptor type A hET-AR
Type:
Enzyme Catalytic Domain
Mol. Mass.:
48736.88
Organism:
Homo sapiens (Human)
Description:
P25101
Residue:
427
  
Inhibitor
Name:
BDBM50289947
Synonyms:
3-(4-Bromo-3-methyl-isoxazol-5-ylsulfamoyl)-thiophene-2-carboxylic acid o-tolyl ester | CHEMBL63805
Type:
Small organic molecule
Emp. Form.:
C16H13BrN2O5S2
Mol. Mass.:
457.319
SMILES:
Cc1noc(NS(=O)(=O)c2ccsc2C(=O)Oc2ccccc2C)c1Br
: