Target
Retinoic acid receptor beta
Ligand
BDBM50290137
Substrate
Meas. Tech.
ChEMBL_217653 (CHEMBL820188)
Ki
13±n/a nM
Citation
 Wong, MFRepa, JJClagett-Dame, MCurley, RW Synthesis and receptor binding affinity of conformationally restricted retinoic acid analogues Bioorg Med Chem Lett 7:2313-2318 (1997)    Article 
Target
Name:
Retinoic acid receptor beta
Synonyms:
HAP NR1B2 RAR-beta RARB Retinoic acid receptor RXR-alpha/Retinoic acid receptor beta Retinoid receptor
Type:
PROTEIN
Mol. Mass.:
50498.70
Organism:
Homo sapiens (Human)
Description:
ChEMBL_1458015
Residue:
455
  
Inhibitor
Name:
BDBM50290137
Synonyms:
(2E,4E)-3-Methyl-5-{2-[(E)-2-(3,3,6,6-tetramethyl-cyclohex-1-enyl)-vinyl]-cyclopropyl}-penta-2,4-dienoic acid | CHEMBL74331
Type:
Small organic molecule
Emp. Form.:
C21H30O2
Mol. Mass.:
314.4617
SMILES:
C\C(\C=C\C1CC1\C=C\C1=CC(C)(C)CCC1(C)C)=C/C(O)=O
: