Target
Adenosine receptor A2a
Ligand
BDBM50290165
Substrate
Meas. Tech.
ChEMBL_30927 (CHEMBL647736)
Ki
1.6±n/a nM
Citation
 Shimada, JKoike, NNonaka, HShiozaki, SYanagawa, KKanda, TKobayashi, HIchimura, MNakamura, JKase, HSuzuki, F Adenosine A2A antagonists with potent anti-cataleptic activity Bioorg Med Chem Lett 7:2349-2352 (1997)    Article 
Target
Name:
Adenosine receptor A2a
Synonyms:
AA2AR_RAT Adenosine A2 receptor Adenosine Receptors A2a (A2a) Adenosine receptors A2a Rat striatal adenosine A2a receptor
Type:
G Protein-Coupled Receptor (GPCR)
Mol. Mass.:
45015.65
Organism:
Rattus norvegicus (rat)
Description:
Rat A2A receptors expressed in CHO cells.
Residue:
410
  
Inhibitor
Name:
BDBM50290165
Synonyms:
8-[(E)-2-(2,4-Dimethoxy-3-methyl-phenyl)-vinyl]-1,3-diethyl-7-methyl-3,7-dihydro-purine-2,6-dione | CHEMBL77691
Type:
Small organic molecule
Emp. Form.:
C21H26N4O4
Mol. Mass.:
398.4555
SMILES:
CCn1c2nc(\C=C\c3ccc(OC)c(C)c3OC)n(C)c2c(=O)n(CC)c1=O
: