Target
Squalene synthase
Ligand
BDBM50290251
Substrate
Meas. Tech.
ChEBML_201929
IC50
46400±n/a nM
Citation
 Overhand, MPieterman, ECohen, LHValentijn, ARMarel, GAvan Boom, JH Synthesis of triphosphonate analogues of farnesyl pyrophosphate. Inhibitors of squalene synthase and protein:farnesyl transferase Bioorg Med Chem Lett 7:2435-2440 (1997)    Article 
Target
Name:
Squalene synthase
Synonyms:
FDFT1 FPP:FPP farnesyltransferase SQS Squalene synthetase
Type:
PROTEIN
Mol. Mass.:
48114.76
Organism:
Homo sapiens (Human)
Description:
ChEMBL_1352847
Residue:
417
  
Inhibitor
Name:
BDBM50290251
Synonyms:
CHEMBL79827 | tripotassium 2,4,6-trioxo-3-[(2E,6E)-3,7,11-trimethyldodeca-2,6,10-trien-1-yl]-1,2,4,6-oxatriphosphinane-2,4,6-tris(olate)
Type:
Small organic molecule
Emp. Form.:
C17H28O7P3
Mol. Mass.:
437.323
SMILES:
[#6]-[#6](-[#6]-[#6]\[#6]=[#6](/[#6])-[#6]-[#6]\[#6]=[#6](\[#6])-[#6])-[#6]-[#6]=[#6]1P([#8-])(=O)[#8]P([#8-])(=O)[#6]=P1([#8])[#8-]
: