Target
Tyrosine-protein kinase ABL1
Ligand
BDBM50175493
Substrate
Meas. Tech.
ChEBML_226180
IC50
400±n/a nM
Citation
 Zimmermann, JBuchdunger, EMett, HMeyer, TLydon, NB Potent and selective inhibitors of the Abl-kinase: phenylamino-pyrimidine (PAP) derivatives Bioorg Med Chem Lett 7:187-192 (1997)    Article 
Target
Name:
Tyrosine-protein kinase ABL1
Synonyms:
ABL ABL1_HUMAN JTK7 Proto-oncogene tyrosine-protein kinase ABL1 Tyrosine-protein kinase ABL V-abl Abelson murine leukemia viral oncogene homolog 1 p150 | tyrosine-protein kinase ABL1 isoform a
Type:
Enzyme
Mol. Mass.:
122897.30
Organism:
Homo sapiens (Human)
Description:
P00519
Residue:
1130
  
Inhibitor
Name:
BDBM50175493
Synonyms:
CHEMBL277931 | N-[3-(4-Pyridin-3-yl-pyrimidin-2-ylamino)-phenyl]-benzamide
Type:
Small organic molecule
Emp. Form.:
C22H17N5O
Mol. Mass.:
367.4033
SMILES:
O=C(Nc1cccc(Nc2nccc(n2)-c2cccnc2)c1)c1ccccc1
: