Target
Alpha-1A/Alpha-1B/Alpha-1D adrenergic receptor
Ligand
BDBM50290514
Substrate
Meas. Tech.
ChEMBL_32561 (CHEMBL645695)
Ki
5±n/a nM
Citation
 Diouf, OCarato, PDepreux, PBonte, JPCaignard, DHGuardiola-Lemaître, BRettori, MCBelzung, CLesieur, D 5-HT1A and 5-HT2A ligands with anxiolytic and antipanic-like properties Bioorg Med Chem Lett 7:2579-2584 (1997)    Article 
Target
Name:
Alpha-1A/Alpha-1B/Alpha-1D adrenergic receptor
Synonyms:
Adrenergic receptor alpha-1 alpha-1 Adrenergic Receptor
Type:
Mol. Mass.:
Description:
ASSAY_ID of EBI is 303470
Components:
This complex has 3 components.
Component 1
Name:
Alpha-1B adrenergic receptor
Synonyms:
ADA1B_RAT Alpha 1B-adrenoceptor Alpha adrenergic receptor 1A and 1B Alpha-1Adrenoceptor Alpha-1B adrenoreceptor | adrenergic Alpha1B
Type:
G Protein-Coupled Receptor (GPCR)
Mol. Mass.:
56606.71
Organism:
Rattus norvegicus (rat)
Description:
Receptor binding assays were performed using rat cortical membranes.
Residue:
515
  
Component 2
Name:
Alpha-1A adrenergic receptor
Synonyms:
ADA1A_RAT Adra1c Alpha-1A adrenoceptor Alpha-1C adrenergic receptor | adrenergic Alpha1A
Type:
Protein
Mol. Mass.:
51620.15
Organism:
Rattus norvegicus (Rat)
Description:
P43140
Residue:
466
  
Component 3
Name:
Alpha-1D adrenergic receptor
Synonyms:
ADA1D_RAT Adra1d Alpha-1D adrenergic receptor | Serotonin 1a (5-HT1a) receptor/Adrenergic receptor alpha-1
Type:
Protein
Mol. Mass.:
59375.97
Organism:
Rattus norvegicus (Rat)
Description:
P23944
Residue:
561
  
Inhibitor
Name:
BDBM50290514
Synonyms:
3-(2-{4-[Bis-(4-fluoro-phenyl)-methylene]-piperidin-1-yl}-ethyl)-6-{4-[4-(2-methoxy-phenyl)-piperazin-1-yl]-butyl}-3H-benzooxazol-2-one | CHEMBL262167
Type:
Small organic molecule
Emp. Form.:
C42H46F2N4O3
Mol. Mass.:
692.8364
SMILES:
[#6]-[#8]-c1ccccc1-[#7]-1-[#6]-[#6]-[#7](-[#6]-[#6]-[#6]-[#6]-c2ccc3n(-[#6]-[#6]-[#7]-4-[#6]-[#6]\[#6](-[#6]-[#6]-4)=[#6](\c4ccc(F)cc4)-c4ccc(F)cc4)c(=O)oc3c2)-[#6]-[#6]-1
: