Target
Carboxylic ester hydrolase
Ligand
BDBM50060481
Substrate
Meas. Tech.
ChEBML_41585
IC50
1180±n/a nM
Citation
 Valenti, PRampa, ABisi, AAndrisano, VCavrini, VFin, LBuriani, AGiusti, P Acetylcholinesterase inhibition by tacrine analogues Bioorg Med Chem Lett 7:2599-2602 (1997)    Article 
Target
Name:
Carboxylic ester hydrolase
Synonyms:
Acetylcholinesterase and butyrylcholinesterase (AChE and BChE) Butyrylcholinesterase (BuChE) | butyrylcholinesterase precursor
Type:
Enzyme
Mol. Mass.:
67776.22
Organism:
Rattus norvegicus (rat)
Description:
Residue:
597
  
Inhibitor
Name:
BDBM50060481
Synonyms:
5,6-Dihydro-benzo[c]acridin-7-ylamine CHEMBL89012
Type:
Small organic molecule
Emp. Form.:
C17H14N2
Mol. Mass.:
246.3065
SMILES:
Nc1c2CCc3ccccc3-c2nc2ccccc12
: