Target
Acetylcholinesterase
Ligand
BDBM50012170
Substrate
Meas. Tech.
ChEBML_28160
IC50
11480±n/a nM
Citation
 Valenti, PRampa, ABisi, AAndrisano, VCavrini, VFin, LBuriani, AGiusti, P Acetylcholinesterase inhibition by tacrine analogues Bioorg Med Chem Lett 7:2599-2602 (1997)    Article 
Target
Name:
Acetylcholinesterase
Synonyms:
ACES_HUMAN Acetylcholinesterase (AChE) | Acetylcholinesterase (human AChE)
Type:
Enzyme
Mol. Mass.:
67792.70
Organism:
Homo sapiens (Human)
Description:
P22303
Residue:
614
  
Inhibitor
Name:
BDBM50012170
Synonyms:
2-Phenyl-quinolin-4-ylamine | CHEMBL50608
Type:
Small organic molecule
Emp. Form.:
C15H12N2
Mol. Mass.:
220.2692
SMILES:
Nc1cc(nc2ccccc12)-c1ccccc1
: