Target
Retinoic acid receptor RXR-beta
Ligand
BDBM50290662
Substrate
Meas. Tech.
ChEBML_196638
EC50
2000±n/a nM
Citation
 Farmer, LJZhi, LJeong, SKallel, EACroston, GFlatten, KSHeyman, RANadzan, AM Synthesis and structure-activity relationships of potent conformationally restricted retinoid X receptor ligands Bioorg Med Chem Lett 7:2747-2752 (1997)    Article 
Target
Name:
Retinoic acid receptor RXR-beta
Synonyms:
NR2B2 RXRB Retinoic acid receptor RXR-beta Retinoid receptor
Type:
PROTEIN
Mol. Mass.:
56932.89
Organism:
Homo sapiens (Human)
Description:
ChEMBL_39045
Residue:
533
  
Inhibitor
Name:
BDBM50290662
Synonyms:
(2E,4E)-3-Methyl-5-[1-(3,5,5,8,8-pentamethyl-5,6,7,8-tetrahydro-naphthalen-2-yl)-cyclopentyl]-penta-2,4-dienoic acid | CHEMBL92394
Type:
Small organic molecule
Emp. Form.:
C26H36O2
Mol. Mass.:
380.5628
SMILES:
C\C(\C=C\C1(CCCC1)c1cc2c(cc1C)C(C)(C)CCC2(C)C)=C/C(O)=O
: