Target
Retinoic acid receptor RXR-alpha
Ligand
BDBM50290660
Substrate
Meas. Tech.
ChEMBL_196497 (CHEMBL798311)
EC50
5±n/a nM
Citation
 Farmer, LJZhi, LJeong, SKallel, EACroston, GFlatten, KSHeyman, RANadzan, AM Synthesis and structure-activity relationships of potent conformationally restricted retinoid X receptor ligands Bioorg Med Chem Lett 7:2747-2752 (1997)    Article 
Target
Name:
Retinoic acid receptor RXR-alpha
Synonyms:
NR2B1 Nuclear receptor subfamily 4 group A member 2 RXRA Retinoic acid receptor RXR-alpha/gamma Retinoid receptor
Type:
PROTEIN
Mol. Mass.:
50820.38
Organism:
Homo sapiens (Human)
Description:
ChEMBL_1456363
Residue:
462
  
Inhibitor
Name:
BDBM50290660
Synonyms:
(2E,4E)-3-Methyl-5-[1-(3,5,5,8,8-pentamethyl-5,6,7,8-tetrahydro-naphthalen-2-yl)-cyclopropyl]-penta-2,4-dienoic acid | CHEMBL92284
Type:
Small organic molecule
Emp. Form.:
C24H32O2
Mol. Mass.:
352.5097
SMILES:
C\C(\C=C\C1(CC1)c1cc2c(cc1C)C(C)(C)CCC2(C)C)=C/C(O)=O
: