Target
Metabotropic glutamate receptor 5
Ligand
BDBM50053588
Substrate
Meas. Tech.
ChEBML_219031
IC50
155000±n/a nM
Citation
 Clark, BPBaker, SRGoldsworthy, JHarris, JRKingston, AE (+)-2-Methyl-4-carboxyphenylglycine (LY367385) selectively antagonises metabotropic glutamate mGluR1 receptors Bioorg Med Chem Lett 7:2777-2780 (1997)    Article 
Target
Name:
Metabotropic glutamate receptor 5
Synonyms:
GPRC1E GRM5_HUMAN metabotropic glutamate 5 | metabotropic glutamate 5a
Type:
Enzyme
Mol. Mass.:
132484.72
Organism:
Homo sapiens (Human)
Description:
Residue:
1212
  
Inhibitor
Name:
BDBM50053588
Synonyms:
(S)-4-(amino(carboxy)methyl)benzoic acid 4-((S)-Amino-carboxy-methyl)-benzoic acid CHEMBL94990 | S-4-Carboxyphenylglycine
Type:
Small organic molecule
Emp. Form.:
C9H9NO4
Mol. Mass.:
195.1721
SMILES:
N[C@H](C(O)=O)c1ccc(cc1)C(O)=O
: