Target
1,3-beta-glucan synthase component GSC2
Ligand
BDBM50290775
Substrate
Meas. Tech.
ChEBML_165
IC50
100±n/a nM
Citation
 Black, RMBalkovec, JMNollstadt, KMDreikorn, SBartizal, KFAbruzzo, GK Synthesis and structure-activity relationships of novel 3′-Hty-substituted pneumocandins Bioorg Med Chem Lett 7:2879-2884 (1997)    Article 
Target
Name:
1,3-beta-glucan synthase component GSC2
Synonyms:
1,3-beta-D-glucan-UDP glucosyltransferase FK506 sensitivity protein 2 FKS2_YEAST GSC2 | Glucan synthase of cerevisiae protein 2
Type:
PROTEIN
Mol. Mass.:
216999.86
Organism:
Saccharomyces cerevisiae
Description:
ChEMBL_11143
Residue:
1895
  
Inhibitor
Name:
BDBM50290775
Synonyms:
CHEMBL415669 | Pneumocandin analogue
Type:
Small organic molecule
Emp. Form.:
C50H79IN8O15
Mol. Mass.:
1159.1113
SMILES:
CCC(C)CC(C)CCCCCCCCC(=O)N[C@@H]1C[C@@H](O)CNC(=O)[C@@H]2[C@@H](O)CCN2C(=O)[C@@H](NC(=O)[C@@H](NC(=O)[C@@H]2C[C@@H](O)CN2C(=O)[C@@H](NC1=O)[C@@H](C)O)[C@@H](O)Cc1ccc(O)c(I)c1)[C@@H](O)CC(N)=O
: