Target
cAMP-dependent protein kinase catalytic subunit alpha/beta/gamma
Ligand
BDBM50290834
Substrate
Meas. Tech.
ChEMBL_161907 (CHEMBL767986)
IC50
>10000±n/a nM
Citation
 Kubo, KShimizu, TOhyama, SiMurooka, HNishitoba, TKato, SKobayashi, YYagi, MIsoe, TNakamura, KOsawa, TIzawa, T A novel series of 4-phenoxyquinolines: potent and highly selective inhibitors of PDGF receptor autophosphorylation Bioorg Med Chem Lett 7:2935-2940 (1997)    Article 
Target
Name:
cAMP-dependent protein kinase catalytic subunit alpha/beta/gamma
Synonyms:
cAMP-dependent protein kinase (PKA)
Type:
Mol. Mass.:
Description:
ASSAY_ID of ChEMBL is 217489
Components:
This complex has 3 components.
Component 1
Name:
cAMP-dependent protein kinase catalytic subunit beta
Synonyms:
KAPCB_HUMAN PKAC-beta cAMP-dependent protein kinase (PKA) cAMP-dependent protein kinase catalytic subunit beta
Type:
PROTEIN
Mol. Mass.:
40631.25
Organism:
Homo sapiens (Human)
Description:
ChEMBL_586348
Residue:
351
  
Component 2
Name:
cAMP-dependent protein kinase catalytic subunit alpha
Synonyms:
KAPCA_HUMAN PKACA cAMP-dependent protein kinase (PKA) cAMP-dependent protein kinase catalytic subunit alpha cAMP-dependent protein kinase catalytic subunit alpha (PKACA) cAMP-dependent protein kinase catalytic subunit alpha isoform 1 | cAMP-dependent protein kinase, alpha-catalytic subunit
Type:
Enzyme Catalytic Subunit
Mol. Mass.:
40598.73
Organism:
Homo sapiens (Human)
Description:
Residue:
351
  
Component 3
Name:
cAMP-dependent protein kinase catalytic subunit gamma
Synonyms:
KAPCG_HUMAN PRKACG cAMP-dependent protein kinase catalytic subunit gamma
Type:
PROTEIN
Mol. Mass.:
40442.03
Organism:
Homo sapiens (Human)
Description:
ChEMBL_104720
Residue:
351
  
Inhibitor
Name:
BDBM50290834
Synonyms:
4-(3,4-Dimethoxy-phenoxy)-6,7-dimethoxy-quinoline | CHEMBL327300
Type:
Small organic molecule
Emp. Form.:
C19H19NO5
Mol. Mass.:
341.3579
SMILES:
COc1ccc(Oc2ccnc3cc(OC)c(OC)cc23)cc1OC
: