Target
5-hydroxytryptamine receptor 1D
Ligand
BDBM50290915
Substrate
Meas. Tech.
ChEBML_1732
Ki
37±n/a nM
Citation
 Jorand-Lebrun, CPauwels, PJPalmier, CChopin, PMoret, CMarien, MHalazy, S Arylpiperazide derivatives of phenylpiperazines as a new class of potent and selective 5-HT1B receptor antagonists Bioorg Med Chem Lett 7:3183-3188 (1997)    Article 
Target
Name:
5-hydroxytryptamine receptor 1D
Synonyms:
5-HT-1D 5-HT1D 5HT1D_HUMAN HTR1DA Serotonin (5-HT) receptor | Serotonin Receptor 1D
Type:
G Protein-Coupled Receptor (GPCR)
Mol. Mass.:
41920.63
Organism:
Homo sapiens (Human)
Description:
Receptor binding assays were performed using human clone stably expressed in CHO cells.
Residue:
377
  
Inhibitor
Name:
BDBM50290915
Synonyms:
4-(2,6-Dimethyl-phenyl)-piperazine-1-carboxylic acid [4-methoxy-3-(4-methyl-piperazin-1-yl)-phenyl]-amide; compound with (E)-but-2-enedioic acid | CHEMBL111302
Type:
Small organic molecule
Emp. Form.:
C25H35N5O2
Mol. Mass.:
437.5777
SMILES:
COc1ccc(NC(=O)N2CCN(CC2)c2c(C)cccc2C)cc1N1CCN(C)CC1
: