Target
5-hydroxytryptamine receptor 1A
Ligand
BDBM50084959
Substrate
Meas. Tech.
ChEBML_957
Ki
>1000±n/a nM
Citation
 Jorand-Lebrun, CPauwels, PJPalmier, CChopin, PMoret, CMarien, MHalazy, S Arylpiperazide derivatives of phenylpiperazines as a new class of potent and selective 5-HT1B receptor antagonists Bioorg Med Chem Lett 7:3183-3188 (1997)    Article 
Target
Name:
5-hydroxytryptamine receptor 1A
Synonyms:
5-HT-1A 5-hydroxytryptamine receptor 1A (5-HT-1A) ADRB2RL1 Dopamine D2 receptor and serotonin 1a receptor HTR1A | Serotonin receptor 1A
Type:
Mol. Mass.:
46122.49
Organism:
Homo sapiens (Human)
Description:
Residue:
422
  
Inhibitor
Name:
BDBM50084959
Synonyms:
11'-Methyl-5-[[2'-methyl-4'-(5-methyl-1,2,4-oxadiazol-3-yl)biphenyl-4-yl]carbonyl]-2,3,6,7-tetrahydrospiro[furo-[2,3-f]indole-3,4'-piperidine](SB-224289) CHEMBL281350 [2'-Methyl-4'-(5-methyl-[1,2,4]oxadiazol-3-yl)-biphenyl-4-yl]-[3-(1-methyl-piperidine)-2,3,6,7-tetrahydro-1-oxa-5-aza-s-indacen-5-yl]-methanone
Type:
Small organic molecule
Emp. Form.:
C32H32N4O3
Mol. Mass.:
520.6215
SMILES:
CN1CCC2(COc3cc4CCN(C(=O)c5ccc(cc5)-c5ccc(cc5C)-c5noc(C)n5)c4cc23)CC1
: