Target
5-hydroxytryptamine receptor 1B
Ligand
BDBM79215
Substrate
Meas. Tech.
ChEBML_1360
Ki
0.140000±n/a nM
Citation
 Jorand-Lebrun, CPauwels, PJPalmier, CChopin, PMoret, CMarien, MHalazy, S Arylpiperazide derivatives of phenylpiperazines as a new class of potent and selective 5-HT1B receptor antagonists Bioorg Med Chem Lett 7:3183-3188 (1997)    Article 
Target
Name:
5-hydroxytryptamine receptor 1B
Synonyms:
5-HT-1B 5-HT1B 5HT1B_HUMAN HTR1DB Serotonin (5-HT) receptor Serotonin Receptor 1B
Type:
G Protein-Coupled Receptor (GPCR)
Mol. Mass.:
43579.17
Organism:
Homo sapiens (Human)
Description:
Receptor binding assays were performed using human clone stably expressed in CHO cells
Residue:
390
  
Inhibitor
Name:
BDBM79215
Synonyms:
CHEMBL15928 GR 127935 hydrochloride hydrate N-[4-methoxy-3-(4-methyl-1-piperazinyl)phenyl]-4-[2-methyl-4-(5-methyl-1,2,4-oxadiazol-3-yl)phenyl]benzamide;hydrochloride N-[4-methoxy-3-(4-methylpiperazino)phenyl]-4-[2-methyl-4-(5-methyl-1,2,4-oxadiazol-3-yl)phenyl]benzamide;hydrochloride cid_11497466
Type:
Small organic molecule
Emp. Form.:
C29H31N5O3
Mol. Mass.:
497.5881
SMILES:
COc1ccc(NC(=O)c2ccc(cc2)-c2ccc(cc2C)-c2noc(C)n2)cc1N1CCN(C)CC1
: