Target
5-hydroxytryptamine receptor 1D
Ligand
BDBM50290918
Substrate
Meas. Tech.
ChEBML_1732
Ki
70±n/a nM
Citation
 Jorand-Lebrun, CPauwels, PJPalmier, CChopin, PMoret, CMarien, MHalazy, S Arylpiperazide derivatives of phenylpiperazines as a new class of potent and selective 5-HT1B receptor antagonists Bioorg Med Chem Lett 7:3183-3188 (1997)    Article 
Target
Name:
5-hydroxytryptamine receptor 1D
Synonyms:
5-HT-1D 5-HT1D 5HT1D_HUMAN HTR1DA Serotonin (5-HT) receptor | Serotonin Receptor 1D
Type:
G Protein-Coupled Receptor (GPCR)
Mol. Mass.:
41920.63
Organism:
Homo sapiens (Human)
Description:
Receptor binding assays were performed using human clone stably expressed in CHO cells.
Residue:
377
  
Inhibitor
Name:
BDBM50290918
Synonyms:
4-(3-Methoxy-phenyl)-piperazine-1-carboxylic acid [4-methoxy-3-(4-methyl-piperazin-1-yl)-phenyl]-amide; compound with (E)-but-2-enedioic acid | CHEMBL108722
Type:
Small organic molecule
Emp. Form.:
C24H33N5O3
Mol. Mass.:
439.5505
SMILES:
COc1cccc(c1)N1CCN(CC1)C(=O)Nc1ccc(OC)c(c1)N1CCN(C)CC1
: