Target
Sodium-dependent serotonin transporter
Ligand
BDBM50291007
Substrate
Meas. Tech.
ChEBML_201995
Ki
0.200000±n/a nM
Citation
 Tamagnan, GNeumeyer, JLGao, YWang, SKula, NSBaldessarini, RJ N-Phthalimidoalkyl derivatives of 2β-carbomethoxy-3β-(4′-iodophenyl)tropane (β-CIT): Brain monoamine transporter affinity Bioorg Med Chem Lett 7:337-340 (1997)    Article 
Target
Name:
Sodium-dependent serotonin transporter
Synonyms:
5-HT Transporter 5HT transporter Anandamid membrane transporter, AMT Monoamine transporters; Norepinephrine & serotonin Slc6a4 Sodium-dependent serotonin transporter (SERT) | imipramine receptor
Type:
Multi-pass membrane protein
Mol. Mass.:
70168.43
Organism:
Rattus norvegicus (rat)
Description:
P31652
Residue:
630
  
Inhibitor
Name:
BDBM50291007
Synonyms:
(3S,5R)-methyl 3-(4-iodophenyl)-8-(8-(1,3-dioxoisoindolin-2-yl)octyl)-8-aza-bicyclo[3.2.1]octane-2-carboxylate | CHEMBL423692
Type:
Small organic molecule
Emp. Form.:
C31H37IN2O4
Mol. Mass.:
628.541
SMILES:
COC(=O)C1C2CCC(CC1c1ccc(I)cc1)N2CCCCCCCCN1C(=O)c2ccccc2C1=O
: