Target
Sodium-dependent dopamine transporter
Ligand
BDBM50010195
Substrate
Meas. Tech.
ChEBML_62623
Ki
0.960000±n/a nM
Citation
 Tamagnan, GNeumeyer, JLGao, YWang, SKula, NSBaldessarini, RJ N-Phthalimidoalkyl derivatives of 2β-carbomethoxy-3β-(4′-iodophenyl)tropane (β-CIT): Brain monoamine transporter affinity Bioorg Med Chem Lett 7:337-340 (1997)    Article 
Target
Name:
Sodium-dependent dopamine transporter
Synonyms:
DA transporter SC6A3_RAT Sodium-dependent dopamine transporter | Sodium-dependent dopamine transporter (DAT)
Type:
Multi-pass membrane protein
Mol. Mass.:
68749.45
Organism:
Rattus norvegicus (rat)
Description:
P23977
Residue:
619
  
Inhibitor
Name:
BDBM50010195
Synonyms:
(3S,5R)-methyl 3-(4-iodophenyl)-8-methyl-8-aza-bicyclo[3.2.1]octane-2-carboxylate 3-(4-Iodo-phenyl)-8-methyl-8-aza-bicyclo[3.2.1]octane-2-carboxylic acid methyl ester | CHEMBL14391
Type:
Small organic molecule
Emp. Form.:
C16H20INO2
Mol. Mass.:
385.24
SMILES:
COC(=O)C1C2CCC(CC1c1ccc(I)cc1)N2C
: