Target
Sucrase-isomaltase, intestinal
Ligand
BDBM50291022
Substrate
Meas. Tech.
ChEMBL_88949 (CHEMBL699120)
Ki
3300±n/a nM
Citation
 Lesur, BDucep, JBLalloz, MNEhrhard, ADanzin, C New deoxynojirimycin derivatives as potent inhibitors of intestinal α-glucohydrolases Bioorg Med Chem Lett 7:355-360 (1997)    Article 
Target
Name:
Sucrase-isomaltase, intestinal
Synonyms:
SUIS_RAT Sucrase-isomaltase | alpha-Glucosidase (α-Glucosidase)
Type:
Enzyme
Mol. Mass.:
210329.04
Organism:
Rattus norvegicus (Rat)
Description:
P23739
Residue:
1841
  
Inhibitor
Name:
BDBM50291022
Synonyms:
(2R,3R,4R,5S)-2-Hydroxymethyl-1-trimethylsilanylmethyl-piperidine-3,4,5-triol | CHEMBL120169
Type:
Small organic molecule
Emp. Form.:
C10H23NO4Si
Mol. Mass.:
249.3794
SMILES:
C[Si](C)(C)CN1C[C@H](O)[C@@H](O)[C@H](O)[C@H]1CO
: