Target
Sucrase-isomaltase, intestinal
Ligand
BDBM50291023
Substrate
Meas. Tech.
ChEBML_206289
Ki
390±n/a nM
Citation
 Lesur, BDucep, JBLalloz, MNEhrhard, ADanzin, C New deoxynojirimycin derivatives as potent inhibitors of intestinal α-glucohydrolases Bioorg Med Chem Lett 7:355-360 (1997)    Article 
Target
Name:
Sucrase-isomaltase, intestinal
Synonyms:
SUIS_RAT Sucrase-isomaltase | alpha-Glucosidase (α-Glucosidase)
Type:
Enzyme
Mol. Mass.:
210329.04
Organism:
Rattus norvegicus (Rat)
Description:
P23739
Residue:
1841
  
Inhibitor
Name:
BDBM50291023
Synonyms:
(2R,3R,4R,5S)-1-[(E)-3-(tert-Butyl-dimethyl-silanyl)-allyl]-2-hydroxymethyl-piperidine-3,4,5-triol | CHEMBL120395
Type:
Small organic molecule
Emp. Form.:
C15H31NO4Si
Mol. Mass.:
317.4964
SMILES:
CC(C)(C)[Si](C)(C)\C=C\CN1C[C@H](O)[C@@H](O)[C@H](O)[C@H]1CO
: