Target
Prothrombin
Ligand
BDBM50291362
Substrate
Meas. Tech.
ChEBML_210597
Ki
2700±n/a nM
Citation
 Kim, SHwang, SYKim, YKYun, MOh, YS Rational design of selective thrombin inhibitors Bioorg Med Chem Lett 7:769-774 (1997)    Article 
Target
Name:
Prothrombin
Synonyms:
Activation peptide fragment 1 Coagulation factor II Prothrombin Thrombin Thrombin light chain
Type:
Enzyme
Mol. Mass.:
70502.73
Organism:
Bos taurus (Bovine)
Description:
P00735
Residue:
625
  
Inhibitor
Name:
BDBM50291362
Synonyms:
1N-[1-[4-amino(aminoimino)methylbenzyl]-2-(1-azepanyl)-2-oxo-(1R)-ethyl]-2-(2-naphthylsulfonamido)acetamide | CHEMBL349483
Type:
Small organic molecule
Emp. Form.:
C28H34N6O4S
Mol. Mass.:
550.672
SMILES:
NN=C(N)c1ccc(C[C@@H](NC(=O)CNS(=O)(=O)c2ccc3ccccc3c2)C(=O)N2CCCCCC2)cc1
: