Target
Serine protease 1
Ligand
BDBM50291360
Substrate
Meas. Tech.
ChEBML_212526
Ki
192000±n/a nM
Citation
 Kim, SHwang, SYKim, YKYun, MOh, YS Rational design of selective thrombin inhibitors Bioorg Med Chem Lett 7:769-774 (1997)    Article 
Target
Name:
Serine protease 1
Synonyms:
Beta-Trypsin PRSS1 TRY1 TRYP1 Trypsin I
Type:
Enzyme
Mol. Mass.:
25790.52
Organism:
Bos taurus (bovine)
Description:
P00760
Residue:
246
  
Inhibitor
Name:
BDBM50291360
Synonyms:
1N-[1-[4-amino(amineimino)methylbenzyl]-2-hexahydro-1-pyridinyl-2-oxo-(1R)-ethyl]-2-(2-naphthylsulfonamido)acetamide | CHEMBL165413
Type:
Small organic molecule
Emp. Form.:
C27H32N6O4S
Mol. Mass.:
536.646
SMILES:
NN=C(N)c1ccc(C[C@@H](NC(=O)CNS(=O)(=O)c2ccc3ccccc3c2)C(=O)N2CCCCC2)cc1
: