Target
Cytosolic phospholipase A2
Ligand
BDBM50288286
Substrate
Meas. Tech.
ChEBML_81567
IC50
40000±n/a nM
Citation
 Springer, DMLuh, BYD'Andrea, SVBronson, JJMansuri, MMBurke, JRGregor, KRStanley, PLTramposch, KM Dicarboxylic acid inhibitors of phospholipase A2 Bioorg Med Chem Lett 7:793-798 (1997)    Article 
Target
Name:
Cytosolic phospholipase A2
Synonyms:
CPLA2 PA24A_HUMAN PLA2G4A Phospholipase A2 | Phospholipase A2 group IVA
Type:
Protein
Mol. Mass.:
85219.30
Organism:
Homo sapiens (Human)
Description:
P47712
Residue:
749
  
Inhibitor
Name:
BDBM50288286
Synonyms:
3-[(1E,3E,5E)-1-((E)-2-Carboxy-1-methyl-vinyl)-4-methyl-6-(2,6,6-trimethyl-cyclohex-1-enyl)-hexa-1,3,5-trienyl]-benzoic acid CHEMBL313583
Type:
Small organic molecule
Emp. Form.:
C27H32O4
Mol. Mass.:
420.5406
SMILES:
C\C(\C=C\C1=C(C)CCCC1(C)C)=C/C=C(/C(/C)=C/C(O)=O)\c1cccc(c1)C(O)=O
: