Target
Insulin receptor
Ligand
BDBM15236
Substrate
Meas. Tech.
ChEMBL_506205 (CHEMBL941409)
Ki
2600±n/a nM
Citation
 Chang, CJGeahlen, RL Protein-Tyrosine Kinase Inhibition: Mechanism-Based Discovery of Antitumor Agents J Nat Prod 55:1529-1560 (1992)  
Target
Name:
Insulin receptor
Synonyms:
INSR INSR_HUMAN Insulin receptor beta subunit
Type:
Receptor Tyrosine Kinase
Mol. Mass.:
156322.60
Organism:
Homo sapiens (Human)
Description:
P06213
Residue:
1382
  
Inhibitor
Name:
BDBM15236
Synonyms:
3,5,7-trihydroxy-2-(3,4,5-trihydroxyphenyl)-4H-chromen-4-one CHEMBL164 Myricetin Myricetin (Myr) | cid_5281672
Type:
Small organic molecule
Emp. Form.:
C15H10O8
Mol. Mass.:
318.2351
SMILES:
Oc1cc(O)c2c(c1)oc(-c1cc(O)c(O)c(O)c1)c(O)c2=O
: