Target
Tyrosine-protein kinase Lck
Ligand
BDBM7457
Substrate
Meas. Tech.
ChEMBL_506203 (CHEMBL941407)
IC50
13900±n/a nM
Citation
 Chang, CJGeahlen, RL Protein-Tyrosine Kinase Inhibition: Mechanism-Based Discovery of Antitumor Agents J Nat Prod 55:1529-1560 (1992)  
Target
Name:
Tyrosine-protein kinase Lck
Synonyms:
2.7.10.2 LCK_HUMAN Leukocyte C-terminal Src kinase Lymphocyte-specific protein tyrosine kinase Protein YT16 Proto-oncogene tyrosine-protein kinase LCK T cell-specific protein-tyrosine kinase
Type:
Mol. Mass.:
57987.83
Organism:
Homo sapiens (Human)
Description:
P06239
Residue:
509
  
Inhibitor
Name:
BDBM7457
Synonyms:
2-(3,4-dihydroxyphenyl)-3,7-dihydroxy-4H-chromen-4-one 2-(3,4-dihydroxyphenyl)-3,7-dihydroxy-chromone;dihydrate Fisetin (14) fisetin
Type:
Small organic molecule
Emp. Form.:
C15H10O6
Mol. Mass.:
286.2363
SMILES:
Oc1ccc2c(c1)oc(-c1ccc(O)c(O)c1)c(O)c2=O
: