Target
Tyrosine-protein kinase Lck
Ligand
BDBM50005886
Substrate
Meas. Tech.
ChEMBL_506203 (CHEMBL941407)
IC50
>2810000±n/a nM
Citation
 Chang, CJGeahlen, RL Protein-Tyrosine Kinase Inhibition: Mechanism-Based Discovery of Antitumor Agents J Nat Prod 55:1529-1560 (1992)  
Target
Name:
Tyrosine-protein kinase Lck
Synonyms:
2.7.10.2 LCK_HUMAN Leukocyte C-terminal Src kinase Lymphocyte-specific protein tyrosine kinase Protein YT16 Proto-oncogene tyrosine-protein kinase LCK T cell-specific protein-tyrosine kinase
Type:
Mol. Mass.:
57987.83
Organism:
Homo sapiens (Human)
Description:
P06239
Residue:
509
  
Inhibitor
Name:
BDBM50005886
Synonyms:
1,8-Dihydroxy-3-methoxy-6-methylanthraquinone CHEMBL42624 physcion
Type:
Small organic molecule
Emp. Form.:
C16H12O5
Mol. Mass.:
284.2635
SMILES:
COc1cc(O)c2C(=O)c3c(O)cc(C)cc3C(=O)c2c1
: