Target
Tyrosine-protein kinase transforming protein Abl
Ligand
BDBM50292493
Substrate
Meas. Tech.
ChEMBL_506213 (CHEMBL942402)
IC50
100000±n/a nM
Citation
 Chang, CJGeahlen, RL Protein-Tyrosine Kinase Inhibition: Mechanism-Based Discovery of Antitumor Agents J Nat Prod 55:1529-1560 (1992)  
Target
Name:
Tyrosine-protein kinase transforming protein Abl
Synonyms:
ABL Tyrosine-protein kinase V-ABL
Type:
Enzyme
Mol. Mass.:
81895.89
Organism:
Abelson murine leukemia virus
Description:
P00521
Residue:
746
  
Inhibitor
Name:
BDBM50292493
Synonyms:
CHEMBL452973 | {[(2R,3S,4R,5R)-5-(6-amino-9H-purin-9-yl)-3,4-dihydroxyoxolan-2-yl]methoxy}({[({[({[4-(2-carbamoyl-2-acetamidoethyl)phenyl]amino}(hydroxy)phosphoryl)oxy](hydroxy)phosphoryl}oxy)(hydroxy)phosphoryl]oxy})phosphinic acid
Type:
Small organic molecule
Emp. Form.:
C21H30N8O17P4
Mol. Mass.:
790.4013
SMILES:
CC(=O)NC(Cc1ccc(NP(O)(=O)OP(O)(=O)OP(O)(=O)OP(O)(=O)OC[C@H]2O[C@H]([C@H](O)[C@@H]2O)n2cnc3c(N)ncnc23)cc1)C(N)=O
: