Target
Proto-oncogene tyrosine-protein kinase Src
Ligand
BDBM50292504
Substrate
Meas. Tech.
ChEMBL_506212 (CHEMBL942401)
IC50
9000±n/a nM
Citation
 Chang, CJGeahlen, RL Protein-Tyrosine Kinase Inhibition: Mechanism-Based Discovery of Antitumor Agents J Nat Prod 55:1529-1560 (1992)  
Target
Name:
Proto-oncogene tyrosine-protein kinase Src
Synonyms:
Calmodulin/Proto-oncogene tyrosine-protein kinase Src Proto-oncogene c-Src SRC SRC_HUMAN V-src sarcoma (Schmidt-Ruppin A-2) viral oncogene homolog (avian) p60-Src | pp60c-src
Type:
Protein
Mol. Mass.:
59838.60
Organism:
Homo sapiens (Human)
Description:
P12931
Residue:
536
  
Inhibitor
Name:
BDBM50292504
Synonyms:
adenosine 5'-(pentahydrogen tetraphosphate)
Type:
Small organic molecule
Emp. Form.:
C10H17N5O16P4
Mol. Mass.:
587.1609
SMILES:
Nc1ncnc2n(cnc12)[C@@H]1O[C@H](COP(O)(=O)OP(O)(=O)OP(O)(=O)OP(O)(O)=O)[C@@H](O)[C@H]1O
: