Target
C-X-C chemokine receptor type 3
Ligand
BDBM50292660
Substrate
Meas. Tech.
ChEMBL_496612 (CHEMBL1003787)
IC50
2510±n/a nM
Citation
 Bongartz, JPBuntinx, MCoesemans, EHermans, BLommen, GVWauwe, JV Synthesis and structure-activity relationship of benzetimide derivatives as human CXCR3 antagonists. Bioorg Med Chem Lett 18:5819-23 (2009)  
Target
Name:
C-X-C chemokine receptor type 3
Synonyms:
AAO92295.1 C-X-C chemokine receptor type 3 (CXCR3) CXCR3 CXCR3_HUMAN chemokine (C-X-C motif) receptor 3
Type:
Enzyme Catalytic Domain
Mol. Mass.:
40665.65
Organism:
Homo sapiens (Human)
Description:
Residue:
368
  
Inhibitor
Name:
BDBM50292660
Synonyms:
(+/-)-1'-(4-bromobenzyl)-1-ethyl-3-phenyl-3,4'-bipiperidine-2,6-dione | CHEMBL497189
Type:
Small organic molecule
Emp. Form.:
C25H29BrN2O2
Mol. Mass.:
469.414
SMILES:
CCN1C(=O)CCC(C2CCN(Cc3ccc(Br)cc3)CC2)(C1=O)c1ccccc1
: