Target
Muscarinic acetylcholine receptor M1
Ligand
BDBM50292671
Substrate
Meas. Tech.
ChEMBL_496613 (CHEMBL1003788)
IC50
>10000±n/a nM
Citation
 Bongartz, JPBuntinx, MCoesemans, EHermans, BLommen, GVWauwe, JV Synthesis and structure-activity relationship of benzetimide derivatives as human CXCR3 antagonists. Bioorg Med Chem Lett 18:5819-23 (2009)  
Target
Name:
Muscarinic acetylcholine receptor M1
Synonyms:
ACM1_HUMAN Cholinergic receptor, muscarinic 1 | Cholinergic, muscarinic M1
Type:
Protein
Mol. Mass.:
51442.54
Organism:
Homo sapiens (Human)
Description:
P11229
Residue:
460
  
Inhibitor
Name:
BDBM50292671
Synonyms:
(+)-2-(1'-(4-bromobenzyl)-3-phenyl-3,4'-bipiperidin-1-yl)acetamide (-)-2-(1'-(4-bromobenzyl)-3-phenyl-3,4'-bipiperidin-1-yl)acetamide | CHEMBL496376
Type:
Small organic molecule
Emp. Form.:
C25H32BrN3O
Mol. Mass.:
470.445
SMILES:
NC(=O)CN1CCCC(C1)(C1CCN(Cc2ccc(Br)cc2)CC1)c1ccccc1
: