Target
Matrilysin
Ligand
BDBM26524
Substrate
Meas. Tech.
ChEMBL_496900 (CHEMBL1001177)
Ki
128000±n/a nM
Citation
 Mazzola, RDZhu, ZSinning, LMcKittrick, BLavey, BSpitler, JKozlowski, JNeng-Yang, SZhou, GGuo, ZOrth, PMadison, VSun, JLundell, DNiu, X Discovery of novel hydroxamates as highly potent tumor necrosis factor-alpha converting enzyme inhibitors. Part II: optimization of the S3' pocket. Bioorg Med Chem Lett 18:5809-14 (2009)  
Target
Name:
Matrilysin
Synonyms:
MMP7 MPSL1 Matrix metalloproteinase-7 (MMP-7) PUMP1
Type:
Enzyme
Mol. Mass.:
29681.54
Organism:
Homo sapiens (Human)
Description:
P09237
Residue:
267
  
Inhibitor
Name:
BDBM26524
Synonyms:
(1R,2S)-1-({3-fluoro-4-[(2-phenylquinolin-4-yl)methoxy]phenyl}methyl)-2-N-hydroxycyclopropane-1,2-dicarboxamide | hydroxamate-cyclopropyl compound, 1
Type:
Small organic molecule
Emp. Form.:
C28H24FN3O4
Mol. Mass.:
485.5063
SMILES:
NC(=O)[C@@]1(Cc2ccc(OCc3cc(nc4ccccc34)-c3ccccc3)c(F)c2)C[C@@H]1C(=O)NO
: