Target
Stromelysin-1
Ligand
BDBM50292682
Substrate
Meas. Tech.
ChEMBL_496899 (CHEMBL1001176)
Ki
>10000000±n/a nM
Citation
 Mazzola, RDZhu, ZSinning, LMcKittrick, BLavey, BSpitler, JKozlowski, JNeng-Yang, SZhou, GGuo, ZOrth, PMadison, VSun, JLundell, DNiu, X Discovery of novel hydroxamates as highly potent tumor necrosis factor-alpha converting enzyme inhibitors. Part II: optimization of the S3' pocket. Bioorg Med Chem Lett 18:5809-14 (2009)  
Target
Name:
Stromelysin-1
Synonyms:
MMP-3 MMP3_HUMAN Matrix metalloproteinase 3 Matrix metalloproteinase-3 (MMP-3) SL-1 Stromelysin 1 | Transin-1
Type:
Enzyme
Mol. Mass.:
53973.13
Organism:
Homo sapiens (Human)
Description:
P08254
Residue:
477
  
Inhibitor
Name:
BDBM50292682
Synonyms:
(1R,2S)-1-(3-fluoro-4-((2-phenylquinolin-4-yl)methoxy)benzyl)-N2-hydroxy-N1,N1-dimethylcyclopropane-1,2-dicarboxamide | CHEMBL496309
Type:
Small organic molecule
Emp. Form.:
C30H28FN3O4
Mol. Mass.:
513.5594
SMILES:
CN(C)C(=O)[C@@]1(Cc2ccc(OCc3cc(nc4ccccc34)-c3ccccc3)c(F)c2)C[C@@H]1C(=O)NO
: