Target
72 kDa type IV collagenase
Ligand
BDBM50292683
Substrate
Meas. Tech.
ChEMBL_496898 (CHEMBL1001175)
Ki
>10000000±n/a nM
Citation
 Mazzola, RDZhu, ZSinning, LMcKittrick, BLavey, BSpitler, JKozlowski, JNeng-Yang, SZhou, GGuo, ZOrth, PMadison, VSun, JLundell, DNiu, X Discovery of novel hydroxamates as highly potent tumor necrosis factor-alpha converting enzyme inhibitors. Part II: optimization of the S3' pocket. Bioorg Med Chem Lett 18:5809-14 (2009)  
Target
Name:
72 kDa type IV collagenase
Synonyms:
72 kDa gelatinase CLG4A Gelatinase A (MMP-2) MMP2_HUMAN Matrix metalloproteinase-2 (MMP 2) Matrix metalloproteinases 2 (MMP-2) | TBE-1
Type:
Enzyme
Mol. Mass.:
73870.36
Organism:
Homo sapiens (Human)
Description:
P08253
Residue:
660
  
Inhibitor
Name:
BDBM50292683
Synonyms:
(1R,2S)-ethyl 2-(hydroxycarbamoyl)-1-(4-((2-phenylquinolin-4-yl)methoxy)benzyl)cyclopropanecarboxylate | CHEMBL495555
Type:
Small organic molecule
Emp. Form.:
C30H28N2O5
Mol. Mass.:
496.5537
SMILES:
CCOC(=O)[C@@]1(Cc2ccc(OCc3cc(nc4ccccc34)-c3ccccc3)cc2)C[C@@H]1C(=O)NO
: