Target
Interstitial collagenase
Ligand
BDBM50292683
Substrate
Meas. Tech.
ChEMBL_496897 (CHEMBL1001174)
Ki
>10000000±n/a nM
Citation
 Mazzola, RDZhu, ZSinning, LMcKittrick, BLavey, BSpitler, JKozlowski, JNeng-Yang, SZhou, GGuo, ZOrth, PMadison, VSun, JLundell, DNiu, X Discovery of novel hydroxamates as highly potent tumor necrosis factor-alpha converting enzyme inhibitors. Part II: optimization of the S3' pocket. Bioorg Med Chem Lett 18:5809-14 (2009)  
Target
Name:
Interstitial collagenase
Synonyms:
CLG MMP1 Matrix metalloproteinase-1 | Matrix metalloproteinase-1 (MMP-1)
Type:
Enzyme
Mol. Mass.:
54010.26
Organism:
Homo sapiens (Human)
Description:
P03956
Residue:
469
  
Inhibitor
Name:
BDBM50292683
Synonyms:
(1R,2S)-ethyl 2-(hydroxycarbamoyl)-1-(4-((2-phenylquinolin-4-yl)methoxy)benzyl)cyclopropanecarboxylate | CHEMBL495555
Type:
Small organic molecule
Emp. Form.:
C30H28N2O5
Mol. Mass.:
496.5537
SMILES:
CCOC(=O)[C@@]1(Cc2ccc(OCc3cc(nc4ccccc34)-c3ccccc3)cc2)C[C@@H]1C(=O)NO
: