Target
Ribonuclease pancreatic
Ligand
BDBM50292719
Substrate
Meas. Tech.
ChEMBL_493877 (CHEMBL944248)
Ki
172000±n/a nM
Citation
 Samanta, ALeonidas, DDDasgupta, SPathak, TZographos, SEOikonomakos, NG Morpholino, piperidino, and pyrrolidino derivatives of pyrimidine nucleosides as inhibitors of ribonuclease A: synthesis, biochemical, and crystallographic evaluation. J Med Chem 52:932-42 (2009)  
Target
Name:
Ribonuclease pancreatic
Synonyms:
CAM-RNase A RNASE1 RNS1
Type:
Enzyme
Mol. Mass.:
16468.79
Organism:
Bison bison (American bison)
Description:
carboxamidomethylated RNase A
Residue:
150
  
Inhibitor
Name:
BDBM50292719
Synonyms:
5'-deoxy-5'-N-piperidinouridine | CHEMBL444258
Type:
Small organic molecule
Emp. Form.:
C14H21N3O5
Mol. Mass.:
311.3336
SMILES:
O[C@@H]1[C@@H](CN2CCCCC2)O[C@H]([C@@H]1O)n1ccc(=O)[nH]c1=O
: