Target
Nitric oxide synthase, inducible
Ligand
BDBM50292747
Substrate
Meas. Tech.
ChEMBL_493907 (CHEMBL944278)
IC50
350±n/a nM
Citation
 Maccallini, CPatruno, ABesker, NAlì, JIAmmazzalorso, ADe Filippis, BFranceschelli, SGiampietro, LPesce, MReale, MTricca, MLRe, NFelaco, MAmoroso, R Synthesis, biological evaluation, and docking studies of N-substituted acetamidines as selective inhibitors of inducible nitric oxide synthase. J Med Chem 52:1481-5 (2010)  
Target
Name:
Nitric oxide synthase, inducible
Synonyms:
HEP-NOS Inducible NO synthase NOS type II NOS2A Nitric oxide synthase, inducible (iNOS) | iNOS
Type:
Homodimer
Mol. Mass.:
131141.95
Organism:
Homo sapiens (Human)
Description:
P35228
Residue:
1153
  
Inhibitor
Name:
BDBM50292747
Synonyms:
1-[(3-{[(Pyridin-4-ylmethyl)amino]methyl}benzyl)amino]ethaniminium bromide | CHEMBL490870
Type:
Small organic molecule
Emp. Form.:
C16H21N4
Mol. Mass.:
269.3642
SMILES:
C\C(N)=[NH+]\Cc1cccc(CNCc2ccncc2)c1
: