Target
Nitric oxide synthase, inducible
Ligand
BDBM50226527
Substrate
Meas. Tech.
ChEMBL_493907 (CHEMBL944278)
IC50
330±n/a nM
Citation
 Maccallini, CPatruno, ABesker, NAlì, JIAmmazzalorso, ADe Filippis, BFranceschelli, SGiampietro, LPesce, MReale, MTricca, MLRe, NFelaco, MAmoroso, R Synthesis, biological evaluation, and docking studies of N-substituted acetamidines as selective inhibitors of inducible nitric oxide synthase. J Med Chem 52:1481-5 (2010)  
Target
Name:
Nitric oxide synthase, inducible
Synonyms:
HEP-NOS Inducible NO synthase NOS type II NOS2A Nitric oxide synthase, inducible (iNOS) | iNOS
Type:
Homodimer
Mol. Mass.:
131141.95
Organism:
Homo sapiens (Human)
Description:
P35228
Residue:
1153
  
Inhibitor
Name:
BDBM50226527
Synonyms:
CHEMBL107251 N-(3-(aminomethyl)benzyl)acetimidamide N-(3-aminomethyl)benzylacetimidamide N-[[3-(aminomethyl)phenyl]methyl]-ethanimidamide | [N-(3-aminomethyl)benzylactamidine]
Type:
Small organic molecule
Emp. Form.:
C10H15N3
Mol. Mass.:
177.2462
SMILES:
CC(N)=NCc1cccc(CN)c1
: