Target
Potassium voltage-gated channel subfamily H member 2
Ligand
BDBM22985
Substrate
Meas. Tech.
ChEMBL_494878 (CHEMBL949428)
IC50
2500±n/a nM
Citation
 O'Neill, PMPark, BKShone, AEMaggs, JLRoberts, PStocks, PABiagini, GABray, PGGibbons, PBerry, NWinstanley, PAMukhtar, ABonar-Law, RHindley, SBambal, RBDavis, CBBates, MHart, TKGresham, SLLawrence, RMBrigandi, RAGomez-delas-Heras, FMGargallo, DVWard, SA Candidate selection and preclinical evaluation of N-tert-butyl isoquine (GSK369796), an affordable and effective 4-aminoquinoline antimalarial for the 21st century. J Med Chem 52:1408-15 (2010)  
Target
Name:
Potassium voltage-gated channel subfamily H member 2
Synonyms:
1,3-beta-glucan synthase component GLS2 ERG Eag-related protein 1 Ether-a-go-go-related gene (HERG) Ether-a-go-go-related gene potassium channel 1 Ether-a-go-go-related gene potassium channel 1 (hERG1) Ether-a-go-go-related protein 1 H-ERG KCNH2 Potassium voltage-gated channel subfamily H member 2 (hERG) Voltage-gated potassium channel subunit Kv11.1 hERG Potassium Channel 1 | putative potassium channel subunit
Type:
Multi-pass membrane protein
Mol. Mass.:
126672.65
Organism:
Homo sapiens (Human)
Description:
Q12809
Residue:
1159
  
Inhibitor
Name:
BDBM22985
Synonyms:
Aralen CHLOROQUINE PHOSPHATE Chloroquine med.21724, Compound 8 | {4-[(7-chloroquinolin-4-yl)amino]pentyl}diethylamine
Type:
Antimalarial
Emp. Form.:
C18H26ClN3
Mol. Mass.:
319.872
SMILES:
CCN(CC)CCCC(C)Nc1ccnc2cc(Cl)ccc12
: