Target
Excitatory amino acid transporter 3
Ligand
BDBM50292988
Substrate
Meas. Tech.
ChEMBL_496044 (CHEMBL998474)
IC50
>300000±n/a nM
Citation
 Jensen, AAErichsen, MNNielsen, CWStensbøl, TBKehler, JBunch, L Discovery of the first selective inhibitor of excitatory amino acid transporter subtype 1. J Med Chem 52:912-5 (2009)  
Target
Name:
Excitatory amino acid transporter 3
Synonyms:
EAA3_HUMAN EAAT3 HEAAC1 | SLC1A1
Type:
Enzyme Catalytic Domain
Mol. Mass.:
57096.71
Organism:
Homo sapiens (Human)
Description:
Excitatory Amino Acid EAAT3 0 HUMAN::P43005
Residue:
524
  
Inhibitor
Name:
BDBM50292988
Synonyms:
2-amino-4-(benzo[d][1,3]dioxol-5-yl)-7-methyl-5-oxo-5,6,7,8-tetrahydro-4H-chromene-3-carbonitrile | CHEMBL474330
Type:
Small organic molecule
Emp. Form.:
C18H16N2O4
Mol. Mass.:
324.3306
SMILES:
CC1CC(=O)C2=C(C1)OC(=N)C(C#N)C2c1ccc2OCOc2c1
: