Target
Excitatory amino acid transporter 3
Ligand
BDBM50293001
Substrate
Meas. Tech.
ChEMBL_496044 (CHEMBL998474)
IC50
>100000±n/a nM
Citation
 Jensen, AAErichsen, MNNielsen, CWStensbøl, TBKehler, JBunch, L Discovery of the first selective inhibitor of excitatory amino acid transporter subtype 1. J Med Chem 52:912-5 (2009)  
Target
Name:
Excitatory amino acid transporter 3
Synonyms:
EAA3_HUMAN EAAT3 HEAAC1 | SLC1A1
Type:
Enzyme Catalytic Domain
Mol. Mass.:
57096.71
Organism:
Homo sapiens (Human)
Description:
Excitatory Amino Acid EAAT3 0 HUMAN::P43005
Residue:
524
  
Inhibitor
Name:
BDBM50293001
Synonyms:
2-amino-4-(biphenyl-4-yl)-5-oxo-7-phenyl-5,6,7,8-tetrahydro-4H-chromene-3-carbonitrile | CHEMBL473530
Type:
Small organic molecule
Emp. Form.:
C28H22N2O2
Mol. Mass.:
418.4865
SMILES:
N=C1OC2=C(C(C1C#N)c1ccc(cc1)-c1ccccc1)C(=O)CC(C2)c1ccccc1
: