Target
Luciferin 4-monooxygenase
Ligand
BDBM50293113
Substrate
Meas. Tech.
ChEMBL_514919 (CHEMBL972645)
IC50
1400±n/a nM
Citation
 Auld, DSZhang, YQSouthall, NTRai, GLandsman, MMacLure, JLangevin, DThomas, CJAustin, CPInglese, J A basis for reduced chemical library inhibition of firefly luciferase obtained from directed evolution. J Med Chem 52:1450-8 (2010)  
Target
Name:
Luciferin 4-monooxygenase
Synonyms:
LUCI_PHOPE
Type:
PROTEIN
Mol. Mass.:
60658.88
Organism:
Photuris pennsylvanica
Description:
ChEMBL_514919
Residue:
545
  
Inhibitor
Name:
BDBM50293113
Synonyms:
2-(4-Chlorophenyl)benzo[d]thiazole | CHEMBL449008
Type:
Small organic molecule
Emp. Form.:
C13H8ClNS
Mol. Mass.:
245.727
SMILES:
Clc1ccc(cc1)-c1nc2ccccc2s1
: