Target
Ephrin type-B receptor 4
Ligand
BDBM50293243
Substrate
Meas. Tech.
ChEMBL_497271 (CHEMBL1007022)
IC50
1±n/a nM
Citation
 Bardelle, CColeman, TCross, DDavenport, SKettle, JGKo, EJLeach, AGMortlock, ARead, JRoberts, NJRobins, PWilliams, EJ Inhibitors of the tyrosine kinase EphB4. Part 2: structure-based discovery and optimisation of 3,5-bis substituted anilinopyrimidines. Bioorg Med Chem Lett 18:5717-21 (2009)  
Target
Name:
Ephrin type-B receptor 4
Synonyms:
EPHB4 Ephrin receptor HTK MYK1 Tyrosine-protein kinase TYRO11 | VHL/Ephrin type-B receptor 4
Type:
Enzyme
Mol. Mass.:
108273.51
Organism:
Homo sapiens (Human)
Description:
P54760
Residue:
987
  
Inhibitor
Name:
BDBM50293243
Synonyms:
3-(4-(5-chlorobenzo[d][1,3]dioxol-4-ylamino)pyrimidin-2-ylamino)-5-(methylsulfonamido)benzenesulfonamide | CHEMBL496760
Type:
Small organic molecule
Emp. Form.:
C18H17ClN6O6S2
Mol. Mass.:
512.947
SMILES:
CS(=O)(=O)Nc1cc(Nc2nccc(Nc3c4OCOc4ccc3Cl)n2)cc(c1)S(N)(=O)=O
: