Target
Ephrin type-B receptor 4
Ligand
BDBM50293237
Substrate
Meas. Tech.
ChEMBL_497272 (CHEMBL1007023)
IC50
741±n/a nM
Citation
 Bardelle, CColeman, TCross, DDavenport, SKettle, JGKo, EJLeach, AGMortlock, ARead, JRoberts, NJRobins, PWilliams, EJ Inhibitors of the tyrosine kinase EphB4. Part 2: structure-based discovery and optimisation of 3,5-bis substituted anilinopyrimidines. Bioorg Med Chem Lett 18:5717-21 (2009)  
Target
Name:
Ephrin type-B receptor 4
Synonyms:
EPHB4 Ephrin receptor HTK MYK1 Tyrosine-protein kinase TYRO11 | VHL/Ephrin type-B receptor 4
Type:
Enzyme
Mol. Mass.:
108273.51
Organism:
Homo sapiens (Human)
Description:
P54760
Residue:
987
  
Inhibitor
Name:
BDBM50293237
Synonyms:
CHEMBL496574 N-[3-[[4-[(5-CHLORO-1,3-BENZODIOXOL-4-YL)AMINO]PYRIMIDIN-2-YL]AMINO]PHENYL]METHANESULFONAMIDE
Type:
Small organic molecule
Emp. Form.:
C18H16ClN5O4S
Mol. Mass.:
433.869
SMILES:
CS(=O)(=O)Nc1cccc(Nc2nccc(Nc3c4OCOc4ccc3Cl)n2)c1
: