Target
DNA polymerase beta
Ligand
BDBM50293303
Substrate
Meas. Tech.
ChEMBL_545143 (CHEMBL1018085)
Ki
390±n/a nM
Citation
 Nakane, HFukushima, MOno, K Differential Inhibition of Reverse Transcriptase and Various DNA Polymerases by Digallic Acid and Its Derivatives J Nat Prod 53:1234-1240 (1990)  
Target
Name:
DNA polymerase beta
Synonyms:
DNA polymerase beta (Pol β) POLB
Type:
Protein
Mol. Mass.:
38188.76
Organism:
Homo sapiens (Human)
Description:
Residue:
335
  
Inhibitor
Name:
BDBM50293303
Synonyms:
CHEMBL498103 | gallic acid 5,6-dihydroxy-3-carboxyphenylester
Type:
Small organic molecule
Emp. Form.:
C14H10O9
Mol. Mass.:
322.2238
SMILES:
OC(=O)c1cc(O)c(O)c(OC(=O)c2ccc(O)c(O)c2O)c1
: