Target
Tissue factor
Ligand
BDBM50293384
Substrate
Meas. Tech.
ChEMBL_572140 (CHEMBL1024282)
IC50
1500±n/a nM
Citation
 Ayral, EGloanec, PBergé, Gde Nanteuil, GMennecier, PRupin, AVerbeuren, TJFulcrand, PMartinez, JHernandez, JF Design, synthesis, and biological evaluation of 1,5-benzothiazepine-4-one derivatives targeting factor VIIa/tissue factor. Bioorg Med Chem Lett 19:1386-91 (2009)  
Target
Name:
Tissue factor
Synonyms:
CD_antigen=CD142 Coagulation factor VII/tissue factor TF Thromboplastin | Tissue factor
Type:
PROTEIN
Mol. Mass.:
33067.61
Organism:
Homo sapiens (Human)
Description:
ChEMBL_936735
Residue:
295
  
Inhibitor
Name:
BDBM50293384
Synonyms:
2-Amino-3-{(3S)-5-[2-({4-[amino(imino)methyl]benzyl}amino)-2-oxoethyl]-3-[benzylsulfonylamino]-4-oxo-2,3,4,5-tetrahydro-1,5-benzothiazepin-7-yl}-propanoic acid, bistrifluoroacetate | CHEMBL554825
Type:
Small organic molecule
Emp. Form.:
C29H32N6O6S2
Mol. Mass.:
624.731
SMILES:
NC(Cc1ccc2SC[C@@H](NS(=O)(=O)Cc3ccccc3)C(=O)N(CC(=O)NCc3ccc(cc3)C(N)=N)c2c1)C(O)=O
: