Target
Aldo-keto reductase family 1 member C3
Ligand
BDBM50293436
Substrate
Meas. Tech.
ChEMBL_572851 (CHEMBL1033527)
Ki
20500±n/a nM
Citation
 Stefane, BBrozic, PVehovc, MRizner, TLGobec, S New cyclopentane derivatives as inhibitors of steroid metabolizing enzymes AKR1C1 and AKR1C3. Eur J Med Chem 44:2563-71 (2009)  
Target
Name:
Aldo-keto reductase family 1 member C3
Synonyms:
17-beta-Hydroxysteroid Dehydrogenase 5 (17-beta-HSD5, AKR1C3) AK1C3_HUMAN Aldo-keto reductase family 1 member C3 Aldo-keto reductase family 1 member C3 (AK1C3a) Aldo-keto-reductase family 1 member C3 Dihydrodiol dehydrogenase 3 Estradiol 17-beta-dehydrogenase KIAA0119 Prostaglandin F synthase Trans-1,2-dihydrobenzene-1,2-diol dehydrogenase
Type:
Enzyme
Mol. Mass.:
36859.86
Organism:
Homo sapiens (Human)
Description:
P42330
Residue:
323
  
Inhibitor
Name:
BDBM50293436
Synonyms:
2-(4-chlorobenzylidene)cyclopentyl ethyl ether | CHEMBL538612
Type:
Small organic molecule
Emp. Form.:
C14H17ClO
Mol. Mass.:
236.737
SMILES:
CCOC1CCC\C1=C/c1ccc(Cl)cc1
: