Target
Acetylcholinesterase
Ligand
BDBM50293451
Substrate
Meas. Tech.
ChEMBL_572858 (CHEMBL1033534)
IC50
0.48±n/a nM
Citation
 Tang, HWei, YBZhang, CNing, FXQiao, WHuang, SLMa, LHuang, ZSGu, LQ Synthesis, biological evaluation and molecular modeling of oxoisoaporphine and oxoaporphine derivatives as new dual inhibitors of acetylcholinesterase/butyrylcholinesterase. Eur J Med Chem 44:2523-32 (2009)  
Target
Name:
Acetylcholinesterase
Synonyms:
ACES_ELEEL Acetylcholinesterase (EeAChE) | ache
Type:
Enzyme
Mol. Mass.:
71812.79
Organism:
Electrophorus electricus (Electric eel)
Description:
Residue:
633
  
Inhibitor
Name:
BDBM50293451
Synonyms:
1-Methyl-1-[2-(7-oxo-7H-1-aza-benzo[de]anthracen-9-ylcarbamoyl)-ethyl]-piperidinium methiode | CHEMBL550075
Type:
Small organic molecule
Emp. Form.:
C25H26N3O2
Mol. Mass.:
400.4923
SMILES:
C[N+]1(CCC(=O)Nc2ccc-3c(c2)C(=O)c2cccc4ccnc-3c24)CCCCC1
: