Target
Sodium- and chloride-dependent glycine transporter 1
Ligand
BDBM50293561
Substrate
Meas. Tech.
ChEMBL_570823 (CHEMBL792716)
Ki
3.8±n/a nM
Citation
 Lowe, JAHou, XSchmidt, CDavid Tingley, FMcHardy, SKalman, MDeninno, SSanner, MWard, KLebel, LTunucci, DValentine, JBronk, BSSchaeffer, E The discovery of a structurally novel class of inhibitors of the type 1 glycine transporter. Bioorg Med Chem Lett 19:2974-6 (2009)  
Target
Name:
Sodium- and chloride-dependent glycine transporter 1
Synonyms:
GlyT-1 Glycine Transporters (GlyT1c) SC6A9_HUMAN Sodium- and chloride-dependent glycine transporter 1 Sodium- and chloride-dependent glycine transporter 1 (GlyT1c) Solute carrier family 6 member 9
Type:
Enzyme
Mol. Mass.:
78270.54
Organism:
Homo sapiens (Human)
Description:
P48067
Residue:
706
  
Inhibitor
Name:
BDBM50293561
Synonyms:
1-Methyl-1H-imidazole-4-carboxylic acid(3-cyclopentylmethyl-3-aza-bicyclo[3.1.0]hex-6-ylmethyl)-(3-trifluoromethoxy-benzyl)-amide | CHEMBL563220
Type:
Small organic molecule
Emp. Form.:
C25H31F3N4O2
Mol. Mass.:
476.5344
SMILES:
Cn1cnc(c1)C(=O)N(C[C@H]1[C@@H]2CN(CC3CCCC3)C[C@H]12)Cc1cccc(OC(F)(F)F)c1
: